Target
Acyl-CoA desaturase 1
Ligand
BDBM50429981
Substrate
Meas. Tech.
ChEMBL_945816 (CHEMBL2339163)
IC50
212±n/a nM
Citation
 Matter, HZoller, GHerling, AWSanchez-Arias, JAPhilippo, CNamane, CKohlmann, MPfenninger, AVoss, MD Benzimidazole-carboxamides as potent and bioavailable stearoyl-CoA desaturase (SCD1) inhibitors from ligand-based virtual screening and chemical optimization. Bioorg Med Chem Lett 23:1817-22 (2013)  
Target
Name:
Acyl-CoA desaturase 1
Synonyms:
ACOD1_RAT Scd Stearoyl-CoA desaturase 1 (SCD1)
Type:
Enzyme
Mol. Mass.:
41485.97
Organism:
Rattus norvegicus (Rat)
Description:
P07308
Residue:
358
  
Inhibitor
Name:
BDBM50429981
Synonyms:
CHEMBL2334635
Type:
Small organic molecule
Emp. Form.:
C25H17F3N4O2S
Mol. Mass.:
494.488
SMILES:
FC(F)(F)c1ccccc1Oc1ccc(cc1)-c1nc2ccc(cc2[nH]1)C(=O)NCc1nccs1
: