Target
Cytochrome P450 3A4
Ligand
BDBM50430059
Substrate
Meas. Tech.
ChEMBL_949160 (CHEMBL2344727)
IC50
6900±n/a nM
Citation
 Han, XCiviello, RLConway, CMCook, DADavis, CDDegnan, APJiang, XJMacci, RMathias, NRMoench, PPin, SSSchartman, RSignor, LJThalody, GTora, GWhiterock, VXu, CMacor, JEDubowchik, GM The synthesis and SAR of calcitonin gene-related peptide (CGRP) receptor antagonists derived from tyrosine surrogates. Part 2. Bioorg Med Chem Lett 23:1870-3 (2013)  
Target
Name:
Cytochrome P450 3A4
Synonyms:
Albendazole monooxygenase CP3A4_HUMAN CYP3A4 CYPIIIA4 Cytochrome P450 3A4 (CYP3A4) Nifedipine oxidase Taurochenodeoxycholate 6-alpha-hydroxylase
Type:
Enzyme
Mol. Mass.:
57349.57
Organism:
Homo sapiens (Human)
Description:
Residue:
503
  
Inhibitor
Name:
BDBM50430059
Synonyms:
CHEMBL2336419
Type:
Small organic molecule
Emp. Form.:
C37H50N8O3
Mol. Mass.:
654.8447
SMILES:
CCc1cc(CC(NC(=O)N2CCC(CC2)N2Cc3ccccc3NC2=O)C(=O)N2CCC(CC2)N2CCCCC2)cc2c(C)n[nH]c12
: