Target
Coagulation factor X
Ligand
BDBM50430382
Substrate
Meas. Tech.
ChEMBL_943827 (CHEMBL2346276)
Ki
>15000±n/a nM
Citation
 Zhang, XGlunz, PWJiang, WSchmitt, ANewman, MBarbera, FABozarth, JMRendina, ARWei, AWen, XRossi, KALuettgen, JMWong, PCKnabb, RMWexler, RRScott Priestley, E Design and synthesis of bicyclic pyrazinone and pyrimidinone amides as potent TF-FVIIa inhibitors. Bioorg Med Chem Lett 23:1604-7 (2013)  
Target
Name:
Coagulation factor X
Synonyms:
Activated coagulation factor X (FXa) Coagulation factor X precursor F10 Factor X heavy chain Factor Xa Stuart-Prower factor
Type:
Enzyme
Mol. Mass.:
54726.60
Organism:
Homo sapiens (Human)
Description:
Residue:
488
  
Inhibitor
Name:
BDBM50430382
Synonyms:
CHEMBL2334317
Type:
Small organic molecule
Emp. Form.:
C19H24N6O2
Mol. Mass.:
368.4329
SMILES:
CCCNc1cnc2CC[C@@H](C(=O)NCc3ccc(cc3)C(N)=N)n2c1=O
: