Target
Prothrombin
Ligand
BDBM50430382
Substrate
Meas. Tech.
ChEMBL_943828 (CHEMBL2346277)
Ki
150±n/a nM
Citation
 Zhang, XGlunz, PWJiang, WSchmitt, ANewman, MBarbera, FABozarth, JMRendina, ARWei, AWen, XRossi, KALuettgen, JMWong, PCKnabb, RMWexler, RRScott Priestley, E Design and synthesis of bicyclic pyrazinone and pyrimidinone amides as potent TF-FVIIa inhibitors. Bioorg Med Chem Lett 23:1604-7 (2013)  
Target
Name:
Prothrombin
Synonyms:
Activation peptide fragment 1 Coagulation factor II Prothrombin precursor Thrombin heavy chain | Thrombin light chain
Type:
Protein
Mol. Mass.:
70029.57
Organism:
Homo sapiens (Human)
Description:
P00734
Residue:
622
  
Inhibitor
Name:
BDBM50430382
Synonyms:
CHEMBL2334317
Type:
Small organic molecule
Emp. Form.:
C19H24N6O2
Mol. Mass.:
368.4329
SMILES:
CCCNc1cnc2CC[C@@H](C(=O)NCc3ccc(cc3)C(N)=N)n2c1=O
: