Target
Delta-type opioid receptor
Ligand
BDBM50430804
Substrate
Meas. Tech.
ChEMBL_943437 (CHEMBL2341881)
Ki
6950±n/a nM
Citation
 Liu, XWang, YXing, YYu, JJi, HKai, MWang, ZWang, DZhang, YZhao, DWang, R Design, synthesis, and pharmacological characterization of novel endomorphin-1 analogues as extremely potentµ-opioid agonists. J Med Chem 56:3102-14 (2013)  
Target
Name:
Delta-type opioid receptor
Synonyms:
D-OR-1 Delta opioid receptor OPIATE Delta OPRD1 OPRK1 | opioid receptor, delta 1
Type:
G Protein-Coupled Receptor (GPCR)
Mol. Mass.:
40382.98
Organism:
Homo sapiens (Human)
Description:
Competition binding assays were carried out using membrane preparations from transfected HN9.10 cells that constitutively expressed the delta opioid receptor.
Residue:
372
  
Inhibitor
Name:
BDBM50430804
Synonyms:
CHEMBL2334769
Type:
Small organic molecule
Emp. Form.:
C33H36N6O6
Mol. Mass.:
612.6755
SMILES:
N[C@@H](Cc1ccc(O)cc1)C(=O)N1CC[C@@H](C1)C(=O)N[C@@H](Cc1c[nH]c2ccccc12)C(=O)N[C@H](C(=C)C(N)=O)c1ccco1
: