Target
Mu-type opioid receptor
Ligand
BDBM50430806
Substrate
Meas. Tech.
ChEMBL_943433 (CHEMBL2341877)
IC50
1.7±n/a nM
Citation
 Liu, XWang, YXing, YYu, JJi, HKai, MWang, ZWang, DZhang, YZhao, DWang, R Design, synthesis, and pharmacological characterization of novel endomorphin-1 analogues as extremely potentµ-opioid agonists. J Med Chem 56:3102-14 (2013)  
Target
Name:
Mu-type opioid receptor
Synonyms:
M-OR-1 Mu opioid receptor OPIATE Mu OPRM_CAVPO
Type:
Enzyme Catalytic Domain
Mol. Mass.:
11165.58
Organism:
GUINEA PIG
Description:
P97266
Residue:
98
  
Inhibitor
Name:
BDBM50430806
Synonyms:
CHEMBL2334771
Type:
Small organic molecule
Emp. Form.:
C33H36N6O6
Mol. Mass.:
612.6755
SMILES:
N[C@@H](Cc1ccc(O)cc1)C(=O)N1CC[C@H](C1)C(=O)N[C@@H](Cc1c[nH]c2ccccc12)C(=O)N[C@H](C(=C)C(N)=O)c1ccco1
: