Target
Prostaglandin E synthase
Ligand
BDBM50431409
Substrate
Meas. Tech.
ChEMBL_952397 (CHEMBL2352763)
IC50
85±n/a nM
Citation
 Shiro, TKakiguchi, KTakahashi, HNagata, HTobe, M Synthesis and biological evaluation of substituted imidazoquinoline derivatives as mPGES-1 inhibitors. Bioorg Med Chem 21:2068-78 (2013)  
Target
Name:
Prostaglandin E synthase
Synonyms:
MGST1L1 PGES PTGES Prostaglandin E synthase (PGES-1) Prostaglandin E synthase-1 (PGES-1) Prostaglandin E2 synthase-1 ( mPGES-1)
Type:
Protein
Mol. Mass.:
17112.22
Organism:
Homo sapiens (Human)
Description:
Residue:
152
  
Inhibitor
Name:
BDBM50431409
Synonyms:
CHEMBL2348042
Type:
Small organic molecule
Emp. Form.:
C17H11BrClN3O
Mol. Mass.:
388.646
SMILES:
Cn1c2cc(Br)ccc2c2nc([nH]c2c1=O)-c1ccccc1Cl
: