Target
Aminopeptidase N
Ligand
BDBM50353018
Substrate
Meas. Tech.
ChEMBL_951230 (CHEMBL2353231)
Ki
0.200000±n/a nM
Citation
 Schmitt, CVoegelin, MMarin, ASchmitt, MSchegg, FHénon, PGuenot, DTarnus, C Selective aminopeptidase-N (CD13) inhibitors with relevance to cancer chemotherapy. Bioorg Med Chem 21:2135-44 (2013)  
Target
Name:
Aminopeptidase N
Synonyms:
AMPN_MOUSE AP-N Anpep Lap-1 Membrane protein p161 mAPN
Type:
PROTEIN
Mol. Mass.:
109642.29
Organism:
Mus musculus
Description:
ChEMBL_879875
Residue:
966
  
Inhibitor
Name:
BDBM50353018
Synonyms:
CHEMBL1821980 | CHEMBL1852660
Type:
Small organic molecule
Emp. Form.:
C17H16BrNO
Mol. Mass.:
330.219
SMILES:
NC1CCc2c(Br)ccc(-c3ccccc3)c2CC1=O
: