Target
Hexokinase-4
Ligand
BDBM50431736
Substrate
Meas. Tech.
ChEMBL_951811 (CHEMBL2353001)
EC50
1600±n/a nM
Citation
 Cheruvallath, ZSGwaltney, SLSabat, MTang, MFeng, JWang, HMiura, JGuntupalli, PJennings, AHosfield, DLee, BWu, Y Design, synthesis and SAR of novel glucokinase activators. Bioorg Med Chem Lett 23:2166-71 (2013)  
Target
Name:
Hexokinase-4
Synonyms:
GCK Glucokinase (GK) HK IV HXK4_HUMAN Hexokinase-D
Type:
Enzyme
Mol. Mass.:
52175.81
Organism:
Homo sapiens (Human)
Description:
P35557
Residue:
465
  
Inhibitor
Name:
BDBM50431736
Synonyms:
CHEMBL2346753
Type:
Small organic molecule
Emp. Form.:
C20H27N3O4S2
Mol. Mass.:
437.576
SMILES:
CCCCC(C(=O)Nc1nccs1)n1c(C)cc(cc1=O)S(=O)(=O)C1CCCC1
: