Target
Cannabinoid receptor 2
Ligand
BDBM50431803
Substrate
Meas. Tech.
ChEMBL_951851 (CHEMBL2353264)
Ki
27870±n/a nM
Citation
 Alvarado, MDecara, JLuque, MJHernandez-Folgado, LGómez-Cañas, MGómez-Ruiz, MFernández-Ruiz, JElguero, JJagerovic, NSerrano, AGoya, Pde Fonseca, FR Novel antiobesity agents: synthesis and pharmacological evaluation of analogues of Rimonabant and of LH21. Bioorg Med Chem 21:1708-16 (2013)  
Target
Name:
Cannabinoid receptor 2
Synonyms:
CANNABINOID CB2 CB2 CB2B CNR2_HUMAN Cannabinoid CB2 receptor Cannabinoid receptor 2 (CB2R) | hCB2
Type:
G Protein-Coupled Receptor (GPCR)
Mol. Mass.:
39690.94
Organism:
Homo sapiens (Human)
Description:
P34972
Residue:
360
  
Inhibitor
Name:
BDBM50431803
Synonyms:
CHEMBL2347045
Type:
Small organic molecule
Emp. Form.:
C21H22N4O
Mol. Mass.:
346.4256
SMILES:
O=C(NN1CCCCC1)c1cc(-c2ccccc2)n(n1)-c1ccccc1
: