Target
Cannabinoid receptor 1
Ligand
BDBM50431801
Substrate
Meas. Tech.
ChEMBL_951850 (CHEMBL2353263)
Ki
>10000±n/a nM
Citation
 Alvarado, MDecara, JLuque, MJHernandez-Folgado, LGómez-Cañas, MGómez-Ruiz, MFernández-Ruiz, JElguero, JJagerovic, NSerrano, AGoya, Pde Fonseca, FR Novel antiobesity agents: synthesis and pharmacological evaluation of analogues of Rimonabant and of LH21. Bioorg Med Chem 21:1708-16 (2013)  
Target
Name:
Cannabinoid receptor 1
Synonyms:
CANN6 CB-R CNR CNR1_HUMAN Cannabinoid receptor Cannabinoid receptor 1 (brain)
Type:
G Protein-Coupled Receptor (GPCR)
Mol. Mass.:
52868.96
Organism:
Homo sapiens (Human)
Description:
P21554
Residue:
472
  
Inhibitor
Name:
BDBM50431801
Synonyms:
CHEMBL2347047
Type:
Small organic molecule
Emp. Form.:
C33H47N3O
Mol. Mass.:
501.7458
SMILES:
CCCCCCCCCCCCCCCCNC(=O)c1nn(c(c1C)-c1ccccc1)-c1ccccc1
: