Target
Leucine-rich repeat serine/threonine-protein kinase 2
Ligand
BDBM50431915
Substrate
Meas. Tech.
ChEMBL_953654 (CHEMBL2352558)
IC50
7.0±n/a nM
Citation
 Garofalo, AWAdler, MAubele, DLBrigham, EFChian, DFranzini, MGoldbach, EKwong, GTMotter, RProbst, GDQuinn, KPRuslim, LSham, HLTam, DTanaka, PTruong, APYe, XMRen, Z Discovery of 4-alkylamino-7-aryl-3-cyanoquinoline LRRK2 kinase inhibitors. Bioorg Med Chem Lett 23:1974-7 (2013)  
Target
Name:
Leucine-rich repeat serine/threonine-protein kinase 2
Synonyms:
Dardarin LRRK2_HUMAN Leucine-rich repeat serine/threonine-protein kinase 2 PARK8
Type:
Protein
Mol. Mass.:
286113.20
Organism:
Homo sapiens (Human)
Description:
Q5S007
Residue:
2527
  
Inhibitor
Name:
BDBM50431915
Synonyms:
CHEMBL2347824
Type:
Small organic molecule
Emp. Form.:
C17H17N5
Mol. Mass.:
291.3504
SMILES:
CC(C)Nc1c(cnc2cc(ccc12)-c1cnn(C)c1)C#N
: