Target
Enoyl-acyl carrier reductase ENR
Ligand
BDBM50431920
Substrate
Meas. Tech.
ChEMBL_953658 (CHEMBL2352562)
IC50
58±n/a nM
Citation
 Cheng, GMuench, SPZhou, YAfanador, GAMui, EJFomovska, ALai, BSPrigge, STWoods, SRoberts, CWHickman, MRLee, PJLeed, SEAuschwitz, JMRice, DWMcLeod, R Design, synthesis, and biological activity of diaryl ether inhibitors of Toxoplasma gondii enoyl reductase. Bioorg Med Chem Lett 23:2035-43 (2013)  
Target
Name:
Enoyl-acyl carrier reductase ENR
Synonyms:
Enoyl-acyl carrier reductase Enoyl-acyl carrier reductase, putative
Type:
PROTEIN
Mol. Mass.:
43663.67
Organism:
Toxoplasma gondii
Description:
ChEMBL_1290812
Residue:
417
  
Inhibitor
Name:
BDBM50431920
Synonyms:
5‐(4‐chloro‐2‐hydroxyphenoxy)‐N‐(5‐methyl‐1,2‐ oxazol‐3‐yl)furan‐2‐carboxamide (32) | CHEMBL2347835
Type:
Small organic molecule
Emp. Form.:
C15H11ClN2O5
Mol. Mass.:
334.711
SMILES:
Cc1cc(NC(=O)c2ccc(Oc3ccc(Cl)cc3O)o2)no1
: