Target
Thymidylate synthase
Ligand
BDBM50432386
Substrate
Meas. Tech.
ChEMBL_952806 (CHEMBL2351311)
IC50
1200±n/a nM
Citation
 Du, QRLi, DDPi, YZLi, JRSun, JFang, FZhong, WQGong, HBZhu, HL Novel 1,3,4-oxadiazole thioether derivatives targeting thymidylate synthase as dual anticancer/antimicrobial agents. Bioorg Med Chem 21:2286-97 (2013)  
Target
Name:
Thymidylate synthase
Synonyms:
TS TYMS Thymidylate synthase (TS) | Thymidylate synthase/GAR transformylase/AICAR transformylase
Type:
Enzyme
Mol. Mass.:
35718.07
Organism:
Homo sapiens (Human)
Description:
Residue:
313
  
Inhibitor
Name:
BDBM50432386
Synonyms:
CHEMBL2348563
Type:
Small organic molecule
Emp. Form.:
C13H13N7O3S
Mol. Mass.:
347.352
SMILES:
Cc1ncc(n1CCSc1nnc(o1)-c1cnccc1N)[N+]([O-])=O
: