Target
Thymidylate synthase
Ligand
BDBM50432387
Substrate
Meas. Tech.
ChEMBL_952806 (CHEMBL2351311)
IC50
890±n/a nM
Citation
 Du, QRLi, DDPi, YZLi, JRSun, JFang, FZhong, WQGong, HBZhu, HL Novel 1,3,4-oxadiazole thioether derivatives targeting thymidylate synthase as dual anticancer/antimicrobial agents. Bioorg Med Chem 21:2286-97 (2013)  
Target
Name:
Thymidylate synthase
Synonyms:
TS TYMS Thymidylate synthase (TS) | Thymidylate synthase/GAR transformylase/AICAR transformylase
Type:
Enzyme
Mol. Mass.:
35718.07
Organism:
Homo sapiens (Human)
Description:
Residue:
313
  
Inhibitor
Name:
BDBM50432387
Synonyms:
CHEMBL2348559
Type:
Small organic molecule
Emp. Form.:
C17H19N5O6S
Mol. Mass.:
421.428
SMILES:
COc1cc(cc(OC)c1OC)-c1nnc(SCCn2c(C)ncc2[N+]([O-])=O)o1
: