Target
Thymidylate synthase
Ligand
BDBM50432392
Substrate
Meas. Tech.
ChEMBL_952806 (CHEMBL2351311)
IC50
3200±n/a nM
Citation
 Du, QRLi, DDPi, YZLi, JRSun, JFang, FZhong, WQGong, HBZhu, HL Novel 1,3,4-oxadiazole thioether derivatives targeting thymidylate synthase as dual anticancer/antimicrobial agents. Bioorg Med Chem 21:2286-97 (2013)  
Target
Name:
Thymidylate synthase
Synonyms:
TS TYMS Thymidylate synthase (TS) | Thymidylate synthase/GAR transformylase/AICAR transformylase
Type:
Enzyme
Mol. Mass.:
35718.07
Organism:
Homo sapiens (Human)
Description:
Residue:
313
  
Inhibitor
Name:
BDBM50432392
Synonyms:
CHEMBL2348577
Type:
Small organic molecule
Emp. Form.:
C16H17N5O4S
Mol. Mass.:
375.402
SMILES:
CCOc1ccc(cc1)-c1nnc(SCCn2c(C)ncc2[N+]([O-])=O)o1
: