Target
CX3C chemokine receptor 1
Ligand
BDBM50432437
Substrate
Meas. Tech.
ChEMBL_953474 (CHEMBL2351085)
Ki
23±n/a nM
Citation
 Karlström, SNordvall, GSohn, DHettman, ATurek, DÅhlin, KKers, AClaesson, MSlivo, CLo-Alfredsson, YPetersson, CBessidskaia, GSvensson, PHRein, TJerning, EMalmberg, ÅAhlgen, CRay, CVares, LIvanov, VJohansson, R Substituted 7-amino-5-thio-thiazolo[4,5-d]pyrimidines as potent and selective antagonists of the fractalkine receptor (CX3CR1). J Med Chem 56:3177-90 (2013)  
Target
Name:
CX3C chemokine receptor 1
Synonyms:
C-X3-C chemokine receptor 1 CX3C1_HUMAN GPR13
Type:
PROTEIN
Mol. Mass.:
40399.45
Organism:
Homo sapiens (Human)
Description:
ChEMBL_953474
Residue:
355
  
Inhibitor
Name:
BDBM50432437
Synonyms:
CHEMBL2349324
Type:
Small organic molecule
Emp. Form.:
C18H22FN5OS2
Mol. Mass.:
407.529
SMILES:
CC(C)C[C@H](CO)Nc1nc(SCc2ccccc2F)nc2nc(N)sc12
: