Target
Bromodomain-containing protein 4
Ligand
BDBM50432472
Substrate
Meas. Tech.
ChEMBL_953475 (CHEMBL2351086)
IC50
360±n/a nM
Citation
 Zhao, LCao, DChen, TWang, YMiao, ZXu, YChen, WWang, XLi, YDu, ZXiong, BLi, JXu, CZhang, NHe, JShen, J Fragment-based drug discovery of 2-thiazolidinones as inhibitors of the histone reader BRD4 bromodomain. J Med Chem 56:3833-51 (2013)  
Target
Name:
Bromodomain-containing protein 4
Synonyms:
BRD4 Bromodomain-containing protein 4 (BRD4) Protein HUNK1
Type:
Protein
Mol. Mass.:
152264.84
Organism:
Homo sapiens (Human)
Description:
O60885
Residue:
1362
  
Inhibitor
Name:
BDBM50432472
Synonyms:
CHEMBL2349340
Type:
Small organic molecule
Emp. Form.:
C24H26ClN3O2S
Mol. Mass.:
456
SMILES:
Cc1[nH]nc2[C@H](CC(=O)OC(C)(C)C)N=C(c3c(C)c(C)sc3-c12)c1ccc(Cl)cc1
: