Target
Bromodomain-containing protein 4
Ligand
BDBM50432477
Substrate
Meas. Tech.
ChEMBL_953486 (CHEMBL2351097)
IC50
2500±n/a nM
Citation
 Zhao, LCao, DChen, TWang, YMiao, ZXu, YChen, WWang, XLi, YDu, ZXiong, BLi, JXu, CZhang, NHe, JShen, J Fragment-based drug discovery of 2-thiazolidinones as inhibitors of the histone reader BRD4 bromodomain. J Med Chem 56:3833-51 (2013)  
Target
Name:
Bromodomain-containing protein 4
Synonyms:
BRD4 Bromodomain-containing protein 4 (BRD4) Protein HUNK1
Type:
Protein
Mol. Mass.:
152264.84
Organism:
Homo sapiens (Human)
Description:
O60885
Residue:
1362
  
Inhibitor
Name:
BDBM50432477
Synonyms:
CHEMBL2349359
Type:
Small organic molecule
Emp. Form.:
C19H19N3O4S3
Mol. Mass.:
449.567
SMILES:
O=C(Nc1cc(ccc1NS(=O)(=O)c1cccs1)-c1csc(=O)[nH]1)C1CCCC1
: