Target
Bromodomain-containing protein 4
Ligand
BDBM50432488
Substrate
Meas. Tech.
ChEMBL_953486 (CHEMBL2351097)
IC50
4400±n/a nM
Citation
 Zhao, LCao, DChen, TWang, YMiao, ZXu, YChen, WWang, XLi, YDu, ZXiong, BLi, JXu, CZhang, NHe, JShen, J Fragment-based drug discovery of 2-thiazolidinones as inhibitors of the histone reader BRD4 bromodomain. J Med Chem 56:3833-51 (2013)  
Target
Name:
Bromodomain-containing protein 4
Synonyms:
BRD4 Bromodomain-containing protein 4 (BRD4) Protein HUNK1
Type:
Protein
Mol. Mass.:
152264.84
Organism:
Homo sapiens (Human)
Description:
O60885
Residue:
1362
  
Inhibitor
Name:
BDBM50432488
Synonyms:
CHEMBL2349346
Type:
Small organic molecule
Emp. Form.:
C16H14N2O4S2
Mol. Mass.:
362.423
SMILES:
COc1ccc(cc1)S(=O)(=O)Nc1cccc(c1)-c1csc(=O)[nH]1
: