Target
Bromodomain-containing protein 4
Ligand
BDBM50432490
Substrate
Meas. Tech.
ChEMBL_953486 (CHEMBL2351097)
IC50
23800±n/a nM
Citation
 Zhao, LCao, DChen, TWang, YMiao, ZXu, YChen, WWang, XLi, YDu, ZXiong, BLi, JXu, CZhang, NHe, JShen, J Fragment-based drug discovery of 2-thiazolidinones as inhibitors of the histone reader BRD4 bromodomain. J Med Chem 56:3833-51 (2013)  
Target
Name:
Bromodomain-containing protein 4
Synonyms:
BRD4 Bromodomain-containing protein 4 (BRD4) Protein HUNK1
Type:
Protein
Mol. Mass.:
152264.84
Organism:
Homo sapiens (Human)
Description:
O60885
Residue:
1362
  
Inhibitor
Name:
BDBM50432490
Synonyms:
CHEMBL2349344
Type:
Small organic molecule
Emp. Form.:
C9H8N2O2S
Mol. Mass.:
208.237
SMILES:
Nc1ccc(cc1O)-c1csc(=O)[nH]1
: