Target
E3 ubiquitin-protein ligase Mdm2
Ligand
BDBM50432636
Substrate
Meas. Tech.
ChEMBL_951640 (CHEMBL2351554)
IC50
2900±n/a nM
Citation
 Gonzalez-Lopez de Turiso, FSun, DRew, YBartberger, MDBeck, HPCanon, JChen, AChow, DCorrell, TLHuang, XJulian, LDKayser, FLo, MCLong, AMMcMinn, DOliner, JDOsgood, TPowers, JPSaiki, AYSchneider, SShaffer, PXiao, SHYakowec, PYan, XYe, QYu, DZhao, XZhou, JMedina, JCOlson, SH Rational design and binding mode duality of MDM2-p53 inhibitors. J Med Chem 56:4053-70 (2013)  
Target
Name:
E3 ubiquitin-protein ligase Mdm2
Synonyms:
Double minute 2 protein E3 ubiquitin-protein ligase Mdm2 (p53-binding protein Mdm2) Human Double Minute 2 (HDM2) MDM2-MDMX p53-Binding Protein MDM2 | p53-binding protein
Type:
Oncoprotein
Mol. Mass.:
55196.54
Organism:
Homo sapiens (Human)
Description:
Q00987
Residue:
491
  
Inhibitor
Name:
BDBM50432636
Synonyms:
CHEMBL2347383 | US11407721, Example 10
Type:
Small organic molecule
Emp. Form.:
C28H26Cl2FNO4
Mol. Mass.:
530.415
SMILES:
CCC[C@@H](N1[C@@H]([C@@H](O[C@@H](Cc2ccc(F)cc2)C1=O)c1ccc(Cl)cc1)c1ccc(Cl)cc1)C(O)=O
: