Target
E3 ubiquitin-protein ligase Mdm2
Ligand
BDBM50432656
Substrate
Meas. Tech.
ChEMBL_951641 (CHEMBL2351555)
IC50
1500±n/a nM
Citation
 Gonzalez-Lopez de Turiso, FSun, DRew, YBartberger, MDBeck, HPCanon, JChen, AChow, DCorrell, TLHuang, XJulian, LDKayser, FLo, MCLong, AMMcMinn, DOliner, JDOsgood, TPowers, JPSaiki, AYSchneider, SShaffer, PXiao, SHYakowec, PYan, XYe, QYu, DZhao, XZhou, JMedina, JCOlson, SH Rational design and binding mode duality of MDM2-p53 inhibitors. J Med Chem 56:4053-70 (2013)  
Target
Name:
E3 ubiquitin-protein ligase Mdm2
Synonyms:
Double minute 2 protein E3 ubiquitin-protein ligase Mdm2 (p53-binding protein Mdm2) Human Double Minute 2 (HDM2) MDM2-MDMX p53-Binding Protein MDM2 | p53-binding protein
Type:
Oncoprotein
Mol. Mass.:
55196.54
Organism:
Homo sapiens (Human)
Description:
Q00987
Residue:
491
  
Inhibitor
Name:
BDBM50432656
Synonyms:
CHEMBL2347403
Type:
Small organic molecule
Emp. Form.:
C24H20Br3NO2
Mol. Mass.:
594.133
SMILES:
CN1[C@@H]([C@@H](O[C@@H](Cc2ccc(Br)cc2)C1=O)c1ccc(Br)cc1)c1ccc(Br)cc1
: