Target
Beta-1 adrenergic receptor
Ligand
BDBM50027879
Substrate
Meas. Tech.
ChEMBL_952276 (CHEMBL2351582)
EC50
12±n/a nM
Citation
 Mistry, SNBaker, JGFischer, PMHill, SJGardiner, SMKellam, B Synthesis and in vitro and in vivo characterization of highlyß1-selectiveß-adrenoceptor partial agonists. J Med Chem 56:3852-65 (2013)  
Target
Name:
Beta-1 adrenergic receptor
Synonyms:
ADRB1 ADRB1_HUMAN Beta-1 adrenoceptor adrenergic Beta1
Type:
G Protein-Coupled Receptor (GPCR)
Mol. Mass.:
51338.40
Organism:
Homo sapiens (Human)
Description:
P08588
Residue:
477
  
Inhibitor
Name:
BDBM50027879
Synonyms:
CGP-12177 | CHEBI:73288
Type:
Small organic molecule
Emp. Form.:
C14H21N3O3
Mol. Mass.:
279.3348
SMILES:
CC(C)(C)NCC(O)COc1cccc2[nH]c(O)nc12
: