Target
Beta-3 adrenergic receptor
Ligand
BDBM50432706
Substrate
Meas. Tech.
ChEMBL_952272 (CHEMBL2351578)
EC50
10000±n/a nM
Citation
 Mistry, SNBaker, JGFischer, PMHill, SJGardiner, SMKellam, B Synthesis and in vitro and in vivo characterization of highlyß1-selectiveß-adrenoceptor partial agonists. J Med Chem 56:3852-65 (2013)  
Target
Name:
Beta-3 adrenergic receptor
Synonyms:
ADRB3 ADRB3_HUMAN Beta-2 adrenergic receptor and beta-3 adrenergic receptor Beta-3 adrenoreceptor | adrenergic Beta3
Type:
G Protein-Coupled Receptor (GPCR)
Mol. Mass.:
43534.88
Organism:
Homo sapiens (Human)
Description:
Residue:
408
  
Inhibitor
Name:
BDBM50432706
Synonyms:
CHEMBL2348220
Type:
Small organic molecule
Emp. Form.:
C24H33N3O6
Mol. Mass.:
459.5353
SMILES:
OC(CNCCNC(=O)Nc1ccc(O)cc1)COc1ccc(OCCOCC2CC2)cc1
: