Target
Cannabinoid receptor 2
Ligand
BDBM50432721
Substrate
Meas. Tech.
ChEMBL_952584 (CHEMBL2354097)
Ki
65±n/a nM
Citation
 Thakur, GABajaj, SParonis, CPeng, YBowman, ALBarak, LSCaron, MGParrish, DDeschamps, JRMakriyannis, A Novel adamantyl cannabinoids as CB1 receptor probes. J Med Chem 56:3904-21 (2013)  
Target
Name:
Cannabinoid receptor 2
Synonyms:
CANNABINOID CB2 CB2 Cannabinoid CB2 receptor Cannabinoid receptor 2 mCB2
Type:
Enzyme Catalytic Domain
Mol. Mass.:
38220.43
Organism:
MOUSE
Description:
P47936
Residue:
347
  
Inhibitor
Name:
BDBM50432721
Synonyms:
CHEMBL2348468
Type:
Small organic molecule
Emp. Form.:
C26H36O3
Mol. Mass.:
396.5622
SMILES:
CC1(C)Oc2cc(cc(O)c2[C@@H]2C[C@@H](CO)CC[C@@H]12)C12CC3CC(CC(C3)C1)C2
: