Target
Inhibitor of nuclear factor kappa-B kinase subunit beta
Ligand
BDBM50418169
Substrate
Meas. Tech.
ChEMBL_957967 (CHEMBL2378059)
IC50
7.9±n/a nM
Citation
 Huang, JJWu, XWJia, JMGuo, XKXue, XJiang, ZYZhang, SLZhang, XJSun, HPYou, QD Novel IKKß inhibitors discovery based on the co-crystal structure by using binding-conformation-based and ligand-based method. Eur J Med Chem 63:269-78 (2013)  
Target
Name:
Inhibitor of nuclear factor kappa-B kinase subunit beta
Synonyms:
I-kappa-B Kinase 2 (IKK-beta) I-kappa-B-kinase beta IKBKB IKK-beta IKK2/IKK1 IKKB_HUMAN Inhibitor of nuclear factor kappa B kinase beta subunit Nuclear factor NF-kappa-B inhibitor kinase beta
Type:
Serine/threonine-protein kinase
Mol. Mass.:
86554.39
Organism:
Homo sapiens (Human)
Description:
GST-tagged IKK-2 was expressed in High Five cells and purified.
Residue:
756
  
Inhibitor
Name:
BDBM50418169
Synonyms:
CHEMBL1761516
Type:
Small organic molecule
Emp. Form.:
C14H15N3O2S
Mol. Mass.:
289.353
SMILES:
CCc1ccc(cc1)-c1cc(C(N)=O)c(NC(N)=O)s1
: