Target
Inhibitor of nuclear factor kappa-B kinase subunit beta
Ligand
BDBM50149846
Substrate
Meas. Tech.
ChEMBL_957967 (CHEMBL2378059)
IC50
3.0±n/a nM
Citation
 Huang, JJWu, XWJia, JMGuo, XKXue, XJiang, ZYZhang, SLZhang, XJSun, HPYou, QD Novel IKKß inhibitors discovery based on the co-crystal structure by using binding-conformation-based and ligand-based method. Eur J Med Chem 63:269-78 (2013)  
Target
Name:
Inhibitor of nuclear factor kappa-B kinase subunit beta
Synonyms:
I-kappa-B Kinase 2 (IKK-beta) I-kappa-B-kinase beta IKBKB IKK-beta IKK2/IKK1 IKKB_HUMAN Inhibitor of nuclear factor kappa B kinase beta subunit Nuclear factor NF-kappa-B inhibitor kinase beta
Type:
Serine/threonine-protein kinase
Mol. Mass.:
86554.39
Organism:
Homo sapiens (Human)
Description:
GST-tagged IKK-2 was expressed in High Five cells and purified.
Residue:
756
  
Inhibitor
Name:
BDBM50149846
Synonyms:
2''-Amino-6''-(2-cyclopropylmethoxy-6-hydroxy-phenyl)-1,2,3,4,5,6-hexahydro-[3,4'']bipyridinyl-3''-carbonitrile | CHEMBL182407
Type:
Small organic molecule
Emp. Form.:
C21H24N4O2
Mol. Mass.:
364.4409
SMILES:
Nc1nc(cc(C2CCCNC2)c1C#N)-c1c(O)cccc1OCC1CC1
: