Target
Inhibitor of nuclear factor kappa-B kinase subunit beta
Ligand
BDBM50353356
Substrate
Meas. Tech.
ChEMBL_957967 (CHEMBL2378059)
IC50
9.1±n/a nM
Citation
 Huang, JJWu, XWJia, JMGuo, XKXue, XJiang, ZYZhang, SLZhang, XJSun, HPYou, QD Novel IKKß inhibitors discovery based on the co-crystal structure by using binding-conformation-based and ligand-based method. Eur J Med Chem 63:269-78 (2013)  
Target
Name:
Inhibitor of nuclear factor kappa-B kinase subunit beta
Synonyms:
I-kappa-B Kinase 2 (IKK-beta) I-kappa-B-kinase beta IKBKB IKK-beta IKK2/IKK1 IKKB_HUMAN Inhibitor of nuclear factor kappa B kinase beta subunit Nuclear factor NF-kappa-B inhibitor kinase beta
Type:
Serine/threonine-protein kinase
Mol. Mass.:
86554.39
Organism:
Homo sapiens (Human)
Description:
GST-tagged IKK-2 was expressed in High Five cells and purified.
Residue:
756
  
Inhibitor
Name:
BDBM50353356
Synonyms:
CHEMBL1831202
Type:
Small organic molecule
Emp. Form.:
C19H20N4O2S
Mol. Mass.:
368.453
SMILES:
CNC1=Nc2cc(sc2N2C(C)C=NC12)-c1cccc(CCC(O)=O)c1
: