Target
Inhibitor of nuclear factor kappa-B kinase subunit beta
Ligand
BDBM50294679
Substrate
Meas. Tech.
ChEMBL_957967 (CHEMBL2378059)
IC50
7.9±n/a nM
Citation
 Huang, JJWu, XWJia, JMGuo, XKXue, XJiang, ZYZhang, SLZhang, XJSun, HPYou, QD Novel IKKß inhibitors discovery based on the co-crystal structure by using binding-conformation-based and ligand-based method. Eur J Med Chem 63:269-78 (2013)  
Target
Name:
Inhibitor of nuclear factor kappa-B kinase subunit beta
Synonyms:
I-kappa-B Kinase 2 (IKK-beta) I-kappa-B-kinase beta IKBKB IKK-beta IKK2/IKK1 IKKB_HUMAN Inhibitor of nuclear factor kappa B kinase beta subunit Nuclear factor NF-kappa-B inhibitor kinase beta
Type:
Serine/threonine-protein kinase
Mol. Mass.:
86554.39
Organism:
Homo sapiens (Human)
Description:
GST-tagged IKK-2 was expressed in High Five cells and purified.
Residue:
756
  
Inhibitor
Name:
BDBM50294679
Synonyms:
7-(3-methoxyphenyl)-N,1-dimethyl-1,6-dihydroimidazo[4,5-d]pyrrolo[2,3-b]pyridin-4-amine | CHEMBL551773
Type:
Small organic molecule
Emp. Form.:
C17H17N5O
Mol. Mass.:
307.3498
SMILES:
CNc1nc2[nH]c(cc2c2n(C)cnc12)-c1cccc(OC)c1
: