Target
Voltage-dependent L-type calcium channel subunit alpha-1C
Ligand
BDBM50434017
Substrate
Meas. Tech.
ChEMBL_958172 (CHEMBL2384387)
IC50
20400±n/a nM
Citation
 Kang, SCooper, GDunne, SFLuan, CHSurmeier, DJSilverman, RB Structure-activity relationship of N,N'-disubstituted pyrimidinetriones as Ca(V)1.3 calcium channel-selective antagonists for Parkinson's disease. J Med Chem 56:4786-97 (2013)  
Target
Name:
Voltage-dependent L-type calcium channel subunit alpha-1C
Synonyms:
CAC1C_RABIT CACN2 CACNL1A1 L-type calcium channel alpha 1C/beta 2A | Voltage-gated L-type calcium channel alpha-1C subunit
Type:
PROTEIN
Mol. Mass.:
242793.78
Organism:
Oryctolagus cuniculus
Description:
ChEMBL_42776
Residue:
2171
  
Inhibitor
Name:
BDBM50434017
Synonyms:
CHEMBL2381033
Type:
Small organic molecule
Emp. Form.:
C18H21ClN2O3
Mol. Mass.:
348.824
SMILES:
CC1CCC(C1)N1C(=O)CC(=O)N(CCc2ccc(Cl)cc2)C1=O
: