Target
Metabotropic glutamate receptor 2
Ligand
BDBM50434135
Substrate
Meas. Tech.
ChEMBL_959167 (CHEMBL2383450)
EC50
0.560000±n/a nM
Citation
 Monn, JAValli, MJMassey, SMHao, JReinhard, MRBures, MGHeinz, BAWang, XCarter, JHGetman, BGStephenson, GAHerin, MCatlow, JTSwanson, SJohnson, BGMcKinzie, DLHenry, SS Synthesis and pharmacological characterization of 4-substituted-2-aminobicyclo[3.1.0]hexane-2,6-dicarboxylates: identification of new potent and selective metabotropic glutamate 2/3 receptor agonists. J Med Chem 56:4442-55 (2013)  
Target
Name:
Metabotropic glutamate receptor 2
Synonyms:
GPRC1B GRM2_HUMAN Metabotropic glutamate receptor mGlu2 | metabotropic glutamate 2
Type:
Enzyme
Mol. Mass.:
95584.88
Organism:
Homo sapiens (Human)
Description:
Q14416
Residue:
872
  
Inhibitor
Name:
BDBM50434135
Synonyms:
CHEMBL2381652
Type:
Small organic molecule
Emp. Form.:
C8H10FNO4
Mol. Mass.:
203.1677
SMILES:
N[C@]1(C[C@@H](F)[C@H]2[C@@H]([C@@H]12)C(O)=O)C(O)=O
: