Target
Metabotropic glutamate receptor 6
Ligand
BDBM50434134
Substrate
Meas. Tech.
ChEMBL_958947 (CHEMBL2382644)
IC50
267±n/a nM
Citation
 Monn, JAValli, MJMassey, SMHao, JReinhard, MRBures, MGHeinz, BAWang, XCarter, JHGetman, BGStephenson, GAHerin, MCatlow, JTSwanson, SJohnson, BGMcKinzie, DLHenry, SS Synthesis and pharmacological characterization of 4-substituted-2-aminobicyclo[3.1.0]hexane-2,6-dicarboxylates: identification of new potent and selective metabotropic glutamate 2/3 receptor agonists. J Med Chem 56:4442-55 (2013)  
Target
Name:
Metabotropic glutamate receptor 6
Synonyms:
GPRC1F GRM6_HUMAN Metabotropic glutamate receptor 6 metabotropic glutamate 6
Type:
Enzyme Catalytic Domain
Mol. Mass.:
95479.26
Organism:
Homo sapiens (Human)
Description:
metabotropic glutamate 6 GRM6 HUMAN::O15303
Residue:
877
  
Inhibitor
Name:
BDBM50434134
Synonyms:
CHEMBL2381641
Type:
Small organic molecule
Emp. Form.:
C9H11NO4
Mol. Mass.:
197.1879
SMILES:
N[C@]1(CC(=C)[C@H]2[C@@H]([C@@H]12)C(O)=O)C(O)=O
: