Target
Prostate-specific antigen
Ligand
BDBM50434143
Substrate
Meas. Tech.
ChEMBL_959198 (CHEMBL2383481)
Ki
102±n/a nM
Citation
 Kostova, MBRosen, DMChen, YMease, RCDenmeade, SR Structural optimization, biological evaluation, and application of peptidomimetic prostate specific antigen inhibitors. J Med Chem 56:4224-35 (2013)  
Target
Name:
Prostate-specific antigen
Synonyms:
APS KLK3 Kallikrein-3 PSA Prostate-specific antigen Seminin
Type:
PROTEIN
Mol. Mass.:
28747.53
Organism:
Homo sapiens (Human)
Description:
ChEMBL_959198
Residue:
261
  
Inhibitor
Name:
BDBM50434143
Synonyms:
CHEMBL2381658
Type:
Small organic molecule
Emp. Form.:
C38H59BBrN7O9
Mol. Mass.:
848.632
SMILES:
CCCC[C@H](NC(=O)[C@H](CCC(N)=O)NC(=O)[C@H](CO)NC(=O)C[C@H](Cc1ccc2ccccc2c1)NC(=O)CCCCCN)C(=O)N[C@H](CCCBr)B(O)O
: