Target
Transient receptor potential cation channel subfamily V member 6
Ligand
BDBM50434549
Substrate
Meas. Tech.
ChEMBL_962122 (CHEMBL2388391)
IC50
13700±n/a nM
Citation
 Hofer, AKovacs, GZappatini, ALeuenberger, MHediger, MALochner, M Design, synthesis and pharmacological characterization of analogs of 2-aminoethyl diphenylborinate (2-APB), a known store-operated calcium channel blocker, for inhibition of TRPV6-mediated calcium transport. Bioorg Med Chem 21:3202-13 (2013)  
Target
Name:
Transient receptor potential cation channel subfamily V member 6
Synonyms:
CaT-L CaT1 ECAC2 TRPV6 | TRPV6_HUMAN
Type:
PROTEIN
Mol. Mass.:
87295.84
Organism:
Homo sapiens (Human)
Description:
ChEMBL_103784
Residue:
765
  
Inhibitor
Name:
BDBM50434549
Synonyms:
CHEMBL2386172
Type:
Small organic molecule
Emp. Form.:
C16H14BF6NO
Mol. Mass.:
361.09
SMILES:
FC(F)(F)c1ccc(cc1)[B-]1([NH2+]CCO1)c1ccc(cc1)C(F)(F)F
: