Target
Tyrosine-protein kinase JAK2
Ligand
BDBM50434777
Substrate
Meas. Tech.
ChEMBL_962509 (CHEMBL2390551)
Ki
20±n/a nM
Citation
 Zak, MHurley, CAWard, SIBergeron, PBarrett, KBalazs, MBlair, WSBull, RChakravarty, PChang, CCrackett, PDeshmukh, GDeVoss, JDragovich, PSEigenbrot, CEllwood, CGaines, SGhilardi, NGibbons, PGradl, SGribling, PHamman, CHarstad, EHewitt, PJohnson, AJohnson, TKenny, JRKoehler, MFBir Kohli, PLabadie, SLee, WPLiao, JLiimatta, MMendonca, RNarukulla, RPulk, RReeve, ASavage, SShia, SSteffek, MUbhayakar, Svan Abbema, AAliagas, IAvitabile-Woo, BXiao, YYang, JKulagowski, JJ Identification of C-2 hydroxyethyl imidazopyrrolopyridines as potent JAK1 inhibitors with favorable physicochemical properties and high selectivity over JAK2. J Med Chem 56:4764-85 (2013)  
Target
Name:
Tyrosine-protein kinase JAK2
Synonyms:
JAK-2 JAK2_HUMAN Janus kinase 2 (JAK2) | Janus kinase 2 (a protein tyrosine kinase)
Type:
Protein
Mol. Mass.:
130684.68
Organism:
Homo sapiens (Human)
Description:
O60674
Residue:
1132
  
Inhibitor
Name:
BDBM50434777
Synonyms:
CHEMBL2386645
Type:
Small organic molecule
Emp. Form.:
C16H20N4O2
Mol. Mass.:
300.3556
SMILES:
OC[C@@H](O)c1nc2cnc3[nH]ccc3c2n1C1CCCCC1
: