Target
G-protein coupled receptor 55
Ligand
BDBM50398226
Substrate
Meas. Tech.
ChEMBL_963381 (CHEMBL2388878)
IC50
>10000±n/a nM
Citation
 Rempel, VVolz, NGläser, FNieger, MBräse, SMüller, CE Antagonists for the orphan G-protein-coupled receptor GPR55 based on a coumarin scaffold. J Med Chem 56:4798-810 (2013)  
Target
Name:
G-protein coupled receptor 55
Synonyms:
G protein-coupled receptor 55 GPR55_HUMAN
Type:
PROTEIN
Mol. Mass.:
36649.72
Organism:
Homo sapiens (Human)
Description:
ChEMBL_1292265
Residue:
319
  
Inhibitor
Name:
BDBM50398226
Synonyms:
CHEMBL2177260
Type:
Small organic molecule
Emp. Form.:
C21H21ClO3
Mol. Mass.:
356.843
SMILES:
CCCCCc1cc(O)c2cc(Cc3ccccc3Cl)c(=O)oc2c1
: