Target
Cyclin-dependent kinase 5
Ligand
BDBM50435025
Substrate
Meas. Tech.
ChEMBL_964508 (CHEMBL2393653)
IC50
>100000±n/a nM
Citation
 Lo Monte, FKramer, TGu, JBrodrecht, MPilakowski, JFuertes, ADominguez, JMPlotkin, BEldar-Finkelman, HSchmidt, B Structure-based optimization of oxadiazole-based GSK-3 inhibitors. Eur J Med Chem 61:26-40 (2013)  
Target
Name:
Cyclin-dependent kinase 5
Synonyms:
CDK5 CDKN5 Cyclin-dependent kinase 5 (CDK5/ p25) Cyclin-dependent-like kinase 5 PSSALRE Tau protein kinase II catalytic subunit
Type:
Enzyme Subunit
Mol. Mass.:
33308.61
Organism:
Homo sapiens (Human)
Description:
Residue:
292
  
Inhibitor
Name:
BDBM50435025
Synonyms:
CHEMBL2391101
Type:
Small organic molecule
Emp. Form.:
C17H13N5O2S
Mol. Mass.:
351.382
SMILES:
CC(=O)Nc1cc(ccn1)-c1nnc(SCc2cccc(c2)C#N)o1
: