Target
Methionine aminopeptidase 1
Ligand
BDBM50435227
Substrate
Meas. Tech.
ChEMBL_963503 (CHEMBL2394384)
IC50
360±n/a nM
Citation
 Zhang, PYang, XZhang, FGabelli, SBWang, RZhang, YBhat, SChen, XFurlani, MAmzel, LMLiu, JOMa, D Pyridinylpyrimidines selectively inhibit human methionine aminopeptidase-1. Bioorg Med Chem 21:2600-17 (2013)  
Target
Name:
Methionine aminopeptidase 1
Synonyms:
Aminopeptidase MAP 1 METAP1 Methionine Aminopeptidase Type 1 (MetAP1) | Peptidase M 1
Type:
Enzyme
Mol. Mass.:
43220.79
Organism:
Homo sapiens (Human)
Description:
MetAP1 with an N-terminal six histidine tag was expressed in baculovirus infected sf9 cells.
Residue:
386
  
Inhibitor
Name:
BDBM50435227
Synonyms:
CHEMBL2392772
Type:
Small organic molecule
Emp. Form.:
C21H19Cl2F3N6
Mol. Mass.:
483.317
SMILES:
Cc1nc(nc(NC2CCN(CC2)c2ncc(cc2Cl)C(F)(F)F)c1Cl)-c1ccccn1
: