Target
Prostacyclin receptor
Ligand
BDBM23954
Substrate
Meas. Tech.
ChEMBL_964176 (CHEMBL2394989)
IC50
13±n/a nM
Citation
 Veinberg, GVorona, MZvejniece, LVilskersts, RVavers, ELiepinsh, EKazoka, HBelyakov, SMishnev, AKuznecovs, JVikainis, SOrlova, NLebedev, APonomaryov, YDambrova, M Synthesis and biological evaluation of 2-(5-methyl-4-phenyl-2-oxopyrrolidin-1-yl)-acetamide stereoisomers as novel positive allosteric modulators of sigma-1 receptor. Bioorg Med Chem 21:2764-71 (2013)  
Target
Name:
Prostacyclin receptor
Synonyms:
PGI receptor PRIPR Prostacyclin (IP) Receptor Prostaglandin I Prostaglandin I2 receptor | Prostanoid IP receptor
Type:
G Protein-Coupled Receptor (GPCR)
Mol. Mass.:
40968.22
Organism:
Homo sapiens (Human)
Description:
The membranes prepared from human platelet were used in binding assay.
Residue:
386
  
Inhibitor
Name:
BDBM23954
Synonyms:
5-[(2E,3aS,4R,5R,6aS)-5-hydroxy-4-[(1E,3S)-3-hydroxy-4-methyloct-1-en-6-yn-1-yl]-octahydropentalen-2-ylidene]pentanoic acid ILOPROST [3H]-Iloprost
Type:
radiolabeled ligand
Emp. Form.:
C22H32O4
Mol. Mass.:
360.4871
SMILES:
[H][C@]12C[C@@H](O)[C@H](\C=C\[C@@H](O)C(C)CC#CC)[C@@]1([H])C\C(C2)=C\CCCC(O)=O
: