Target
Histamine H2 receptor
Ligand
BDBM50403559
Substrate
Meas. Tech.
ChEMBL_964196 (CHEMBL2395009)
IC50
270±n/a nM
Citation
 Veinberg, GVorona, MZvejniece, LVilskersts, RVavers, ELiepinsh, EKazoka, HBelyakov, SMishnev, AKuznecovs, JVikainis, SOrlova, NLebedev, APonomaryov, YDambrova, M Synthesis and biological evaluation of 2-(5-methyl-4-phenyl-2-oxopyrrolidin-1-yl)-acetamide stereoisomers as novel positive allosteric modulators of sigma-1 receptor. Bioorg Med Chem 21:2764-71 (2013)  
Target
Name:
Histamine H2 receptor
Synonyms:
Gastric receptor I HISTAMINE H2 HRH2_HUMAN Histamine H2-Gs alpha S
Type:
G Protein-Coupled Receptor (GPCR)
Mol. Mass.:
40115.31
Organism:
Homo sapiens (Human)
Description:
Residue:
359
  
Inhibitor
Name:
BDBM50403559
Synonyms:
Brumetadina | CIMETIDINE
Type:
Small organic molecule
Emp. Form.:
C10H16N6S
Mol. Mass.:
252.339
SMILES:
CNC(NCCSCc1[nH]cnc1C)=NC#N
: