Target
Galanin receptor type 1
Ligand
BDBM50378616
Substrate
Meas. Tech.
ChEMBL_964199 (CHEMBL2395012)
IC50
0.160000±n/a nM
Citation
 Veinberg, GVorona, MZvejniece, LVilskersts, RVavers, ELiepinsh, EKazoka, HBelyakov, SMishnev, AKuznecovs, JVikainis, SOrlova, NLebedev, APonomaryov, YDambrova, M Synthesis and biological evaluation of 2-(5-methyl-4-phenyl-2-oxopyrrolidin-1-yl)-acetamide stereoisomers as novel positive allosteric modulators of sigma-1 receptor. Bioorg Med Chem 21:2764-71 (2013)  
Target
Name:
Galanin receptor type 1
Synonyms:
GAL1-R GALNR1 GALR1_HUMAN Galanin receptor 1 | Galanin receptor type 1
Type:
Enzyme Catalytic Domain
Mol. Mass.:
38976.60
Organism:
Homo sapiens (Human)
Description:
Galanin R1 GALR1 HUMAN::P47211
Residue:
349
  
Inhibitor
Name:
BDBM50378616
Synonyms:
GALANIN
Type:
Small organic molecule
Emp. Form.:
C146H213N43O40
Mol. Mass.:
3210.5175
SMILES:
CC[C@H](C)[C@H](NC(=O)[C@H](C)NC(=O)[C@H](Cc1cnc[nH]1)NC(=O)[C@@H]1CCCN1C(=O)CNC(=O)[C@H](CC(C)C)NC(=O)[C@H](CC(C)C)NC(=O)[C@H](Cc1ccc(O)cc1)NC(=O)CNC(=O)[C@H](C)NC(=O)[C@H](CO)NC(=O)[C@H](CC(N)=O)NC(=O)[C@H](CC(C)C)NC(=O)[C@@H](NC(=O)[C@H](Cc1c[nH]c2ccccc12)NC(=O)CN)[C@@H](C)O)C(=O)N[C@@H](CC(O)=O)C(=O)N[C@@H](CC(N)=O)C(=O)N[C@@H](Cc1cnc[nH]1)C(=O)N[C@@H](CCCN=C(N)N)C(=O)N[C@@H](CO)C(=O)N[C@@H](Cc1ccccc1)C(=O)N[C@@H](Cc1cnc[nH]1)C(=O)N[C@@H](CC(O)=O)C(=O)N[C@@H](CCCCN)C(=O)N[C@@H](Cc1ccc(O)cc1)C(=O)NCC(=O)N[C@@H](CC(C)C)C(=O)N[C@@H](C)C(N)=O
: