Target
Aurora kinase B
Ligand
BDBM50435693
Substrate
Meas. Tech.
ChEMBL_965037 (CHEMBL2396199)
IC50
2.3±n/a nM
Citation
 Zheng, YZheng, MLing, XLiu, YXue, YAn, LGu, NJi, MJin, M Design, synthesis, quantum chemical studies and biological activity evaluation of pyrazole-benzimidazole derivatives as potent Aurora A/B kinase inhibitors. Bioorg Med Chem Lett 23:3523-30 (2013)  
Target
Name:
Aurora kinase B
Synonyms:
AIK2 AIM1 ARK2 AURKB_HUMAN Aurora B-INCENP Aurora kinase B (AURKB) STK-1 STK12 Serine/threonine-protein kinase aurora B
Type:
Protein
Mol. Mass.:
39327.72
Organism:
Homo sapiens (Human)
Description:
Q96GD4
Residue:
344
  
Inhibitor
Name:
BDBM50435693
Synonyms:
CHEMBL2392112
Type:
Small organic molecule
Emp. Form.:
C16H14ClN7O2S
Mol. Mass.:
403.846
SMILES:
Cc1ccc2nc([nH]c2c1)-c1n[nH]cc1Nc1cc(Cl)nc(n1)S(C)(=O)=O
: