Target
Aurora kinase B
Ligand
BDBM50435700
Substrate
Meas. Tech.
ChEMBL_965037 (CHEMBL2396199)
IC50
191±n/a nM
Citation
 Zheng, YZheng, MLing, XLiu, YXue, YAn, LGu, NJi, MJin, M Design, synthesis, quantum chemical studies and biological activity evaluation of pyrazole-benzimidazole derivatives as potent Aurora A/B kinase inhibitors. Bioorg Med Chem Lett 23:3523-30 (2013)  
Target
Name:
Aurora kinase B
Synonyms:
AIK2 AIM1 ARK2 AURKB_HUMAN Aurora B-INCENP Aurora kinase B (AURKB) STK-1 STK12 Serine/threonine-protein kinase aurora B
Type:
Protein
Mol. Mass.:
39327.72
Organism:
Homo sapiens (Human)
Description:
Q96GD4
Residue:
344
  
Inhibitor
Name:
BDBM50435700
Synonyms:
CHEMBL2392104
Type:
Small organic molecule
Emp. Form.:
C30H30ClN9OS
Mol. Mass.:
600.137
SMILES:
Clc1cc(Nc2c[nH]nc2-c2nc3ccc(CN4CCCCC4)cc3[nH]2)nc(Sc2ccc(NC(=O)C3CC3)cc2)n1
: