Target
Aurora kinase A
Ligand
BDBM50435693
Substrate
Meas. Tech.
ChEMBL_965038 (CHEMBL2396200)
IC50
45±n/a nM
Citation
 Zheng, YZheng, MLing, XLiu, YXue, YAn, LGu, NJi, MJin, M Design, synthesis, quantum chemical studies and biological activity evaluation of pyrazole-benzimidazole derivatives as potent Aurora A/B kinase inhibitors. Bioorg Med Chem Lett 23:3523-30 (2013)  
Target
Name:
Aurora kinase A
Synonyms:
AIK ARK-1 AURA AURKA_HUMAN Aurora 2 Aurora kinase A (AURKA) Aurora kinase A (Aurora-2) Aurora/IPL1-related kinase 1 Breast tumor-amplified kinase IAK1 STK15 GN Serine/threonine kinase 15 Serine/threonine-protein kinase 6 Serine/threonine-protein kinase aurora-A aurora-2 | hARK1
Type:
Serine/threonine-protein kinase
Mol. Mass.:
45830.98
Organism:
Homo sapiens (Human)
Description:
O14965
Residue:
403
  
Inhibitor
Name:
BDBM50435693
Synonyms:
CHEMBL2392112
Type:
Small organic molecule
Emp. Form.:
C16H14ClN7O2S
Mol. Mass.:
403.846
SMILES:
Cc1ccc2nc([nH]c2c1)-c1n[nH]cc1Nc1cc(Cl)nc(n1)S(C)(=O)=O
: