Target
Enoyl-acyl carrier reductase ENR
Ligand
BDBM50435717
Substrate
Meas. Tech.
ChEMBL_965386 (CHEMBL2394873)
IC50
19±n/a nM
Citation
 Muench, SPStec, JZhou, YAfanador, GAMcPhillie, MJHickman, MRLee, PJLeed, SEAuschwitz, JMPrigge, STRice, DWMcLeod, R Development of a triclosan scaffold which allows for adaptations on both the A- and B-ring for transport peptides. Bioorg Med Chem Lett 23:3551-5 (2013)  
Target
Name:
Enoyl-acyl carrier reductase ENR
Synonyms:
Enoyl-acyl carrier reductase Enoyl-acyl carrier reductase, putative
Type:
PROTEIN
Mol. Mass.:
43663.67
Organism:
Toxoplasma gondii
Description:
ChEMBL_1290812
Residue:
417
  
Inhibitor
Name:
BDBM50435717
Synonyms:
CHEMBL2392450 | N‐{[4‐(2,4‐dichlorophenoxy)‐3‐ hydroxyphenyl]methyl}‐5‐methyl‐1,2‐oxazole‐3‐ carboxamide (27)
Type:
Small organic molecule
Emp. Form.:
C18H14Cl2N2O4
Mol. Mass.:
393.221
SMILES:
Cc1cc(no1)C(=O)NCc1ccc(Oc2ccc(Cl)cc2Cl)c(O)c1
: