Target
Enoyl-acyl carrier reductase ENR
Ligand
BDBM50435719
Substrate
Meas. Tech.
ChEMBL_965386 (CHEMBL2394873)
IC50
34±n/a nM
Citation
 Muench, SPStec, JZhou, YAfanador, GAMcPhillie, MJHickman, MRLee, PJLeed, SEAuschwitz, JMPrigge, STRice, DWMcLeod, R Development of a triclosan scaffold which allows for adaptations on both the A- and B-ring for transport peptides. Bioorg Med Chem Lett 23:3551-5 (2013)  
Target
Name:
Enoyl-acyl carrier reductase ENR
Synonyms:
Enoyl-acyl carrier reductase Enoyl-acyl carrier reductase, putative
Type:
PROTEIN
Mol. Mass.:
43663.67
Organism:
Toxoplasma gondii
Description:
ChEMBL_1290812
Residue:
417
  
Inhibitor
Name:
BDBM50435719
Synonyms:
CHEMBL2392448
Type:
Small organic molecule
Emp. Form.:
C18H13ClN2O4
Mol. Mass.:
356.76
SMILES:
OCCc1cc(no1)-c1ccc(Oc2ccc(cc2O)C#N)c(Cl)c1
: