Target
Dual specificity protein phosphatase 15
Ligand
BDBM50436358
Substrate
Meas. Tech.
ChEMBL_966892 (CHEMBL2401183)
IC50
2900±n/a nM
Citation
 He, YLiu, SMenon, AStanford, SOppong, EGunawan, AMWu, LWu, DJBarrios, AMBottini, NCato, ACZhang, ZY A potent and selective small-molecule inhibitor for the lymphoid-specific tyrosine phosphatase (LYP), a target associated with autoimmune diseases. J Med Chem 56:4990-5008 (2013)  
Target
Name:
Dual specificity protein phosphatase 15
Synonyms:
C20orf57 DUSP15 VHY | Vaccinia virus VH1-related dual-specific protein phosphatase Y
Type:
PROTEIN
Mol. Mass.:
31893.33
Organism:
Homo sapiens (Human)
Description:
ChEMBL_107613
Residue:
295
  
Inhibitor
Name:
BDBM50436358
Synonyms:
CHEMBL2396718
Type:
Small organic molecule
Emp. Form.:
C28H22ClNO6
Mol. Mass.:
503.93
SMILES:
CCCNC(=O)COc1ccc(cc1)-c1oc2cc(O)c(cc2c1C#Cc1cccc(Cl)c1)C(O)=O
: