Target
Cytochrome P450 3A4
Ligand
BDBM50436477
Substrate
Meas. Tech.
ChEMBL_966467 (CHEMBL2399055)
IC50
>30000±n/a nM
Citation
 Décor, AGrand-Maître, CHucke, OO'Meara, JKuhn, CConstantineau-Forget, LBrochu, CMalenfant, EBertrand-Laperle, MBordeleau, JGhiro, EPesant, MFazal, GGorys, VLittle, MBoucher, CBordeleau, STurcotte, PGuo, TGarneau, MSpickler, CGauthier, A Design, synthesis and biological evaluation of novel aminothiazoles as antiviral compounds acting against human rhinovirus. Bioorg Med Chem Lett 23:3841-7 (2013)  
Target
Name:
Cytochrome P450 3A4
Synonyms:
Albendazole monooxygenase CP3A4_HUMAN CYP3A4 CYPIIIA4 Cytochrome P450 3A4 (CYP3A4) Nifedipine oxidase Taurochenodeoxycholate 6-alpha-hydroxylase
Type:
Enzyme
Mol. Mass.:
57349.57
Organism:
Homo sapiens (Human)
Description:
Residue:
503
  
Inhibitor
Name:
BDBM50436477
Synonyms:
CHEMBL2397315
Type:
Small organic molecule
Emp. Form.:
C14H15F3N4OS
Mol. Mass.:
344.355
SMILES:
C[C@@H](CC(F)(F)F)C(=O)Nc1nc(C)c(s1)-c1ccc(N)nc1
: