Target
Bcl-2-like protein 1
Ligand
BDBM50436648
Substrate
Meas. Tech.
ChEMBL_967612 (CHEMBL2399232)
Kd
79±n/a nM
Citation
 Sleebs, BEKersten, WJKulasegaram, SNikolakopoulos, GHatzis, EMoss, RMParisot, JPYang, HCzabotar, PEFairlie, WDLee, EFAdams, JMChen, Lvan Delft, MFLowes, KNWei, AHuang, DCColman, PMStreet, IPBaell, JBWatson, KLessene, G Discovery of potent and selective benzothiazole hydrazone inhibitors of Bcl-XL. J Med Chem 56:5514-40 (2014)  
Target
Name:
Bcl-2-like protein 1
Synonyms:
Anti-apoptotic Bcl-2 protein Apoptosis regulator Bcl-X BCL2-like 1 isoform 1 BCL2L1 Bcl-2-like protein 1 (Bcl-XL) Bcl-xL/Bcl-2-binding component 3 Bcl2-antagonist of cell death (BAD)
Type:
Mitochondrion membrane; Single-pass membrane protein
Mol. Mass.:
26039.60
Organism:
Homo sapiens (Human)
Description:
Residue:
233
  
Inhibitor
Name:
BDBM50436648
Synonyms:
CHEMBL2398286
Type:
Small organic molecule
Emp. Form.:
C21H16N4O2S
Mol. Mass.:
388.442
SMILES:
CC(N=Nc1nc2ccccc2s1)c1cccc(c1)-c1cccc(n1)C(O)=O
: